{"text_format":"1","workbook":"xlsx","n_sheets":4,"sheets":["Read Me First","Checklist","Scorecard","Best in Class"],"not_rendered":{"charts":1,"images":2,"macros":1,"external_links":0,"defined_names":15,"comments":0,"pivot_tables":0},"unopened":[],"bounds":{"document_bytes":16777216,"sheet_cells":100000,"rows_first":2000,"rows_last":500,"rows_between":2000,"halvings":0,"cell_chars":16384,"cell_head_chars":4096},"cells_cut":0,"cells_raw":0,"read":"whole","date_system":"1900"}

{"sheet":"Read Me First","index":0,"n_rows":35,"n_cols":5,"rows_kept":35,"cut":false,"hidden":false,"merged":[[2,0,2,3],[5,0,7,3],[23,0,29,2]]}
[]
["Instructions"]
["The following worksheet is intented to help Data Center and Facility Managers evaluate their data center operation and maintenance programs.   To assist in the process, we have identified 10 categories each with various elements.   The 10 point grading scale is designed to allow for a wide range of possible answers and provide for greater accuracy in the final evaluation.   This is a subjective process, so it is best to not spend too much time with evaluating each element.  Your first impression is usually the most accurate.   After completing the entire assement, review each category and make any corrections you feel appropriate."]
[]
[]
["In an effort to provide the greatest opportunity to evaluate any given element within each category, we have established the following 10 point scale.   The descriptors are meant to aid your evaluation.   It is best that you consider how well your organization meets the particular element then score it on a scale from 1 to 10"]
[]
[]
[]
["Rating"]
[1,"Nonexistent"]
[2,"Existent, but seriously deficient-needs complete modification"]
[3,"Existent, but deficient-needs serious modification"]
[4,"Existent, but deficient-needs slight modification"]
[5,"Variably adequate-some components range from nonexistent to needing serious modification"]
[6,"Variably adequate-some components range from nonexistent to needing slight modification"]
[7,"Almost meets performance requirments-needs only slight modificaton"]
[8,"Meets performance requirements with no additional modifications",null,null," "]
[9,"Exceeds performance requirements"]
[10,"Best in class"]
[]
[]
[]
["To begin the assessment, click on the \"Checklist\" tab.  Each Category is identified in Column A, while each element within that Category is identified in column B.  Colum F contains a dropdown box to indicate whether your organization incorporates this practice.  If it does not apply, go to the dropdown box and change the \"Yes\" to a \"No\".  Colum K contains a dropdown box with 10 possible levels of attainment for each element.  An achievement of 10 is considered best in class.  To better understand best in class achievement, examples are provided in the tab labeled \"Best in Class\".  Select a descriptor that best describes your organization's maturity relative to the Best in Class descriptors.   Your corresponding score will update in column H.  After completing each section, your total is summarized at the bottom of the checklist."]
[]
[]
[]
[]
[]
[]
[]
[]
[]
["We recognize the efforts of Tad Davies, Brian Antosh and Rick Tinucci"]
["           Questions can be directed to Tad Davies | tad.davies@FodereConsulting.com |  314-265-3735"]

{"sheet":"Checklist","index":1,"n_rows":145,"n_cols":11,"rows_kept":145,"cut":false,"hidden":false,"merged":[[12,8,12,9],[27,8,27,9],[42,8,42,9],[54,8,54,9],[7,1,7,3],[8,1,8,3],[9,1,9,3],[10,1,10,3],[129,5,130,5],[123,8,123,9],[66,8,66,9],[76,8,76,9],[88,8,88,9],[97,8,97,9],[110,8,110,9]]}
[null,null,null,"`"]
[]
[]
["Category","Elements"]
["Documentation",null,null,null,null,"Observed (Y/N)",null,"Rating",null,null,"Condition"]
[]
[]
[null,"Document Management Program",null,null,null,"Yes",null,{"$f":"IFERROR(INDEX('Read Me First'!A$10:B$20,MATCH(K8,'Read Me First'!B$10:B$20,),MATCH(Checklist!H$5,'Read Me First'!A$10:B$10,)), )","v":0}]
[null,"Drawings",null,null,null,"Yes",null,{"$f":"IFERROR(INDEX('Read Me First'!A$10:B$20,MATCH(K9,'Read Me First'!B$10:B$20,),MATCH(Checklist!H$5,'Read Me First'!A$10:B$10,)), )","v":0}]
[null,"Checklists- facility, security, vendor, etc.",null,null,null,"Yes",null,{"$f":"IFERROR(INDEX('Read Me First'!A$10:B$20,MATCH(K10,'Read Me First'!B$10:B$20,),MATCH(Checklist!H$5,'Read Me First'!A$10:B$10,)), )","v":0}]
[null,"Equipment Manuals",null,null,null,"Yes",null,{"$f":"IFERROR(INDEX('Read Me First'!A$10:B$20,MATCH(K11,'Read Me First'!B$10:B$20,),MATCH(Checklist!H$5,'Read Me First'!A$10:B$10,)), )","v":0}]
[]
[null,"Section Total",null,null,null,null,null,{"$f":"SUM(H8:H12)","v":0},"of 40"]
[]
[]
[]
[]
["Maintenance Program",null,null,null,null,"Observed (Y/N)",null,"Rating",null,null,"Condition"]
[]
[]
[null,"Standards and Procedures",null,null,null,"Yes",null,{"$f":"IFERROR(INDEX('Read Me First'!A$10:B$20,MATCH(K21,'Read Me First'!B$10:B$20,),MATCH(Checklist!H$5,'Read Me First'!A$10:B$10,)), )","v":0}]
[null,"Scope of Services Defined",null,null,null,"Yes",null,{"$f":"IFERROR(INDEX('Read Me First'!A$10:B$20,MATCH(K22,'Read Me First'!B$10:B$20,),MATCH(Checklist!H$5,'Read Me First'!A$10:B$10,)), )","v":0}]
[null,"Spare Part Inventory and Parts Management Plan",null,null,null,"Yes",null,{"$f":"IFERROR(INDEX('Read Me First'!A$10:B$20,MATCH(K23,'Read Me First'!B$10:B$20,),MATCH(Checklist!H$5,'Read Me First'!A$10:B$10,)), )","v":0}]
[null,"Asset Management Database",null,null,null,"Yes",null,{"$f":"IFERROR(INDEX('Read Me First'!A$10:B$20,MATCH(K24,'Read Me First'!B$10:B$20,),MATCH(Checklist!H$5,'Read Me First'!A$10:B$10,)), )","v":0}]
[null,"Vendor Selection Process",null,null,null,"Yes",null,{"$f":"IFERROR(INDEX('Read Me First'!A$10:B$20,MATCH(K25,'Read Me First'!B$10:B$20,),MATCH(Checklist!H$5,'Read Me First'!A$10:B$10,)), )","v":0}]
[null,"Testing Equipment Calibration Records",null,null,null,"Yes",null,{"$f":"IFERROR(INDEX('Read Me First'!A$10:B$20,MATCH(K26,'Read Me First'!B$10:B$20,),MATCH(Checklist!H$5,'Read Me First'!A$10:B$10,)), )","v":0}]
[]
[null,"Section Total",null,null,null,null,null,{"$f":"SUM(H21:H27)","v":0},"of 60"]
[]
[]
["Safety",null,null,null,null,"Observed (Y/N)",null,"Rating",null,null,"Condition"]
[]
[]
[" ","Workplace Safety Program",null,null,null,"Yes",null,{"$f":"IFERROR(INDEX('Read Me First'!A$10:B$20,MATCH(K34,'Read Me First'!B$10:B$20,),MATCH(Checklist!H$5,'Read Me First'!A$10:B$10,)), )","v":0}]
[" ","Vendor Safety/Orientation Program",null,null,null,"Yes",null,{"$f":"IFERROR(INDEX('Read Me First'!A$10:B$20,MATCH(K35,'Read Me First'!B$10:B$20,),MATCH(Checklist!H$5,'Read Me First'!A$10:B$10,)), )","v":0}]
[" ","Hazard Risk Analysis",null,null,null,"Yes",null,{"$f":"IFERROR(INDEX('Read Me First'!A$10:B$20,MATCH(K36,'Read Me First'!B$10:B$20,),MATCH(Checklist!H$5,'Read Me First'!A$10:B$10,)), )","v":0}]
[null,"Hazard Communications Program",null,null,null,"Yes",null,{"$f":"IFERROR(INDEX('Read Me First'!A$10:B$20,MATCH(K37,'Read Me First'!B$10:B$20,),MATCH(Checklist!H$5,'Read Me First'!A$10:B$10,)), )","v":0}]
[null,"Hot Work",null,null,null,"Yes",null,{"$f":"IFERROR(INDEX('Read Me First'!A$10:B$20,MATCH(K38,'Read Me First'!B$10:B$20,),MATCH(Checklist!H$5,'Read Me First'!A$10:B$10,)), )","v":0}]
[null,"Personal Protection Equipment (PPE)",null,null,null,"Yes",null,{"$f":"IFERROR(INDEX('Read Me First'!A$10:B$20,MATCH(K39,'Read Me First'!B$10:B$20,),MATCH(Checklist!H$5,'Read Me First'!A$10:B$10,)), )","v":0}]
[null,"Arc Flash",null,null,null,"Yes",null,{"$f":"IFERROR(INDEX('Read Me First'!A$10:B$20,MATCH(K40,'Read Me First'!B$10:B$20,),MATCH(Checklist!H$5,'Read Me First'!A$10:B$10,)), )","v":0}]
[null,"Lockout/Tagout Program",null,null,null,"Yes",null,{"$f":"IFERROR(INDEX('Read Me First'!A$10:B$20,MATCH(K41,'Read Me First'!B$10:B$20,),MATCH(Checklist!H$5,'Read Me First'!A$10:B$10,)), )","v":0}]
[]
[null,"Section Total",null,null,null,null,null,{"$f":"SUM(H34:H41)","v":0},"of 80"]
[]
[]
[]
[]
["Performance",null,null,null,null,"Observed (Y/N)",null,"Rating",null,null,"Condition"]
[]
[]
[null,"Service Level Agreements",null,null,null,"Yes",null,{"$f":"IFERROR(INDEX('Read Me First'!A$10:B$20,MATCH(K51,'Read Me First'!B$10:B$20,),MATCH(Checklist!H$5,'Read Me First'!A$10:B$10,)), )","v":0}]
[null,"Key Performance Metrics",null,null,null,"Yes",null,{"$f":"IFERROR(INDEX('Read Me First'!A$10:B$20,MATCH(K52,'Read Me First'!B$10:B$20,),MATCH(Checklist!H$5,'Read Me First'!A$10:B$10,)), )","v":0}]
[null,"Continuous Improvement Program",null,null,null,"Yes",null,{"$f":"IFERROR(INDEX('Read Me First'!A$10:B$20,MATCH(K53,'Read Me First'!B$10:B$20,),MATCH(Checklist!H$5,'Read Me First'!A$10:B$10,)), )","v":0}]
[]
[null,"Section Total",null,null,null,null,null,{"$f":"SUM(H51:H54)","v":0},"of 30"]
[]
[]
["Operational Management",null,null,null,null,"Observed (Y/N)",null,"Rating",null,null,"Condition"]
[]
[]
[null,"Services Scope Description",null,null,null,"Yes",null,{"$f":"IFERROR(INDEX('Read Me First'!A$10:B$20,MATCH(K61,'Read Me First'!B$10:B$20,),MATCH(Checklist!H$5,'Read Me First'!A$10:B$10,)), )","v":0}]
[null,"Staff Roles and Responsibilities",null,null,null,"Yes",null,{"$f":"IFERROR(INDEX('Read Me First'!A$10:B$20,MATCH(K62,'Read Me First'!B$10:B$20,),MATCH(Checklist!H$5,'Read Me First'!A$10:B$10,)), )","v":0}]
[null,"Materials, Parts, and Tools Inventory",null,null,null,"Yes",null,{"$f":"IFERROR(INDEX('Read Me First'!A$10:B$20,MATCH(K63,'Read Me First'!B$10:B$20,),MATCH(Checklist!H$5,'Read Me First'!A$10:B$10,)), )","v":0}]
[null,"Work Order Mangement System",null,null,null,"Yes",null,{"$f":"IFERROR(INDEX('Read Me First'!A$10:B$20,MATCH(K64,'Read Me First'!B$10:B$20,),MATCH(Checklist!H$5,'Read Me First'!A$10:B$10,)), )","v":0}]
[null,"Shift Turnover Communications",null,null,null,"Yes",null,{"$f":"IFERROR(INDEX('Read Me First'!A$10:B$20,MATCH(K65,'Read Me First'!B$10:B$20,),MATCH(Checklist!H$5,'Read Me First'!A$10:B$10,)), )","v":0}]
[]
[null,null,null,null,null,null,null,{"$f":"SUM(H61:H66)","v":0},"of 50"]
[]
[]
["Security",null,null,null,null,"Observed (Y/N)",null,"Rating",null,null,"Condition"]
[]
[]
[null,"Vendor and Employess Access Control",null,null,null,"Yes",null,{"$f":"IFERROR(INDEX('Read Me First'!A$10:B$20,MATCH(K73,'Read Me First'!B$10:B$20,),MATCH(Checklist!H$5,'Read Me First'!A$10:B$10,)), )","v":0}]
[null,"Key, badge, and fob Audit Program",null,null,null,"Yes",null,{"$f":"IFERROR(INDEX('Read Me First'!A$10:B$20,MATCH(K74,'Read Me First'!B$10:B$20,),MATCH(Checklist!H$5,'Read Me First'!A$10:B$10,)), )","v":0}]
[null,"Security Walk-thru's",null,null,null,"Yes",null,{"$f":"IFERROR(INDEX('Read Me First'!A$10:B$20,MATCH(K75,'Read Me First'!B$10:B$20,),MATCH(Checklist!H$5,'Read Me First'!A$10:B$10,)), )","v":0}]
[]
[null,"Section Total",null,null,null,null,null,{"$f":"SUM(H73:H76)","v":0},"of 30"]
[]
[]
[]
[]
["Emergency Preparedness and Response",null,null,null,null,"Observed (Y/N)",null,"Rating",null,null,"Condition"]
[]
[]
[null,"Emergency Operating Procedures",null,null,null,"Yes",null,{"$f":"IFERROR(INDEX('Read Me First'!A$10:B$20,MATCH(K85,'Read Me First'!B$10:B$20,),MATCH(Checklist!H$5,'Read Me First'!A$10:B$10,)), )","v":0}]
[null,"Incident Logging and Reporting",null,null,null,"Yes",null,{"$f":"IFERROR(INDEX('Read Me First'!A$10:B$20,MATCH(K86,'Read Me First'!B$10:B$20,),MATCH(Checklist!H$5,'Read Me First'!A$10:B$10,)), )","v":0}]
[null,"Root Cause Analysis",null,null,null,"Yes",null,{"$f":"IFERROR(INDEX('Read Me First'!A$10:B$20,MATCH(K87,'Read Me First'!B$10:B$20,),MATCH(Checklist!H$5,'Read Me First'!A$10:B$10,)), )","v":0}]
[]
[null,null,null,null,null,null,null,{"$f":"SUM(H85:H88)","v":0},"of 30"]
[]
[]
["Change Management",null,null,null,null,"Observed (Y/N)",null,"Rating",null,null,"Condition"]
[]
[]
[null,"Change Control Process",null,null,null,"Yes",null,{"$f":"IFERROR(INDEX('Read Me First'!A$10:B$20,MATCH(K95,'Read Me First'!B$10:B$20,),MATCH(Checklist!H$5,'Read Me First'!A$10:B$10,)), )","v":0}]
[null,"Communications",null,null,null,"Yes",null,{"$f":"IFERROR(INDEX('Read Me First'!A$10:B$20,MATCH(K96,'Read Me First'!B$10:B$20,),MATCH(Checklist!H$5,'Read Me First'!A$10:B$10,)), )","v":0}]
[]
[null,"Section Total",null,null,null,null,null,{"$f":"SUM(H95:H97)","v":0},"of 20"]
[]
[]
[]
[]
["Monitoring",null,null,null,null,"Observed (Y/N)",null,"Rating",null,null,"Condition"]
[null,null,null,null,null,"Observed (Y/N)",null,"Rating",null,null,"Condition"]
[]
[null,"Targeted towards maintenance",null,null,null,"Yes",null,{"$f":"IFERROR(INDEX('Read Me First'!A$10:B$20,MATCH(K106,'Read Me First'!B$10:B$20,),MATCH(Checklist!H$5,'Read Me First'!A$10:B$10,)), )","v":0}]
[null,"Automatic Monitoring and Alerting",null,null,null,"Yes",null,{"$f":"IFERROR(INDEX('Read Me First'!A$10:B$20,MATCH(K107,'Read Me First'!B$10:B$20,),MATCH(Checklist!H$5,'Read Me First'!A$10:B$10,)), )","v":0}]
[null,"Flexible, multiple/open protocols",null,null,null,"Yes",null,{"$f":"IFERROR(INDEX('Read Me First'!A$10:B$20,MATCH(K108,'Read Me First'!B$10:B$20,),MATCH(Checklist!H$5,'Read Me First'!A$10:B$10,)), )","v":0}]
[null,"Performance Benchmarking",null,null,null,"Yes",null,{"$f":"IFERROR(INDEX('Read Me First'!A$10:B$20,MATCH(K109,'Read Me First'!B$10:B$20,),MATCH(Checklist!H$5,'Read Me First'!A$10:B$10,)), )","v":0}]
[]
[null,"Section Total",null,null,null,null,null,{"$f":"SUM(H106:H110)","v":0},"of 40"]
[]
[]
[]
[]
["Training",null,null,null,null,"Observed (Y/N)",null,"Rating",null,null,"Condition"]
[]
[]
[null,"Management Commitment",null,null,null,"Yes",null,{"$f":"IFERROR(INDEX('Read Me First'!A$10:B$20,MATCH(K119,'Read Me First'!B$10:B$20,),MATCH(Checklist!H$5,'Read Me First'!A$10:B$10,)), )","v":0}]
[null,"Individual Training Records and Plan",null,null,null,"Yes",null,{"$f":"IFERROR(INDEX('Read Me First'!A$10:B$20,MATCH(K120,'Read Me First'!B$10:B$20,),MATCH(Checklist!H$5,'Read Me First'!A$10:B$10,)), )","v":0}]
{"$rows_left_out":26}
{"sheet":"Scorecard","index":2,"n_rows":0,"n_cols":0,"rows_kept":0,"cut":false,"hidden":false,"merged":[[35,9,35,10]]}

{"sheet":"Best in Class","index":3,"n_rows":351,"n_cols":5,"rows_kept":351,"cut":false,"hidden":false,"merged":[[1,1,1,8]]}
[]
[null,"Best in Class Artibutes.  For each Element, best practice attributes are provided for you to see how your operation compares.  We hope this aides you in your scoring!"]
[null,"Category","Element","Attribute","Sub-attribute"]
[1,"Documentation"]
[null,null,"Document Management Program"]
[null,null,null,"Policies & procedures for document management in place"]
[null,null,null,"Electronic Document Management System with Version Control"]
[null,null,null,"Past versions available for reference in knowledge base"]
[null,null,null,"Revision history- redlined versions"]
[null,null,null,"Applies to documents and drawings"]
[]
[null,null,"Drawings"]
[null,null,null,"Reflect existing conditions"]
[null,null,null,"Accessible to stakeholders"]
[null,null,null,"In readable software format- pdf"]
[null,null,null,"Critical hardcopies availabe for emergency"]
[]
[null,null,"Checklists- facility, security, vendor, etc."]
[null,null,null,"Checklists reviewed"]
[null,null,null,"Consistency of format exists"]
[null,null,null,"Hard copies converted to electronic format"]
[null,null,null,"Archival process in place"]
[null,null,null,"Completed equipment checklist- copy with the unit"]
[null,null,null,null,"Past year"]
[]
[null,null,"Equipment Manuals"]
[null,null,null,"Correct manuals- equipment and O & M"]
[null,null,null,"Electronic and hard copy"]
[null,null,null,"Obselete manuals purged"]
[]
[2,"Maintenance Program"]
[null,null,"Standards and Procedures"]
[null,null,null,"In electronic form and version control in place."]
[null,null,null,"Review and approval process in place."]
[null,null,null,"Hard copies labeled as reference only, master copy location identified."]
[null,null,null,null,"Prevent older versions being used."]
[null,null,null,"Group responsible for procedures identified."]
[null,null,null,"Annual review by owner of standard or procedure."]
[null,null,null,"Inventory of all standards and procedures by owner."]
[null,null,null,"Standardized format across the enterprise."]
[]
[null,null,"Scope of Services Defined"]
[null,null,null,"For all equipment ie. - Emergency Power, UPS Power, Cooling, Transformers, Fire Protection, etc."]
[null,null,null,"Work performed internally is documented the same as externally performed work."]
[null,null,null,"Contracts and procedures and maintenance reports are all in sync."]
[null,null,null,null,"Checklist cross-referenced against scope of services."]
[null,null,null,"Scope reflects the differences in manufacturers equipment."]
[null,null,null,"Frequency should be driven by meantime between failure data"]
[]
[null,null,"Spare Part Inventory and Parts Mangement Plan"]
[null,null,null,"Inventory of parts kept and updated."]
[null,null,null,"Good inventory tested where possible and tagged with test date.  "]
[null,null,null,"Inventory stored in proper environmental conditions."]
[null,null,null,"Bad parts immediately discarded or tagged for return."]
[null,null,null,null,"Prevent bad parts from being installed."]
[null,null,null,"Delivery time analysis."]
[]
[null,null,"Asset Management Database"]
[null,null,null,"Equipment identified."]
[null,null,null,"Barcoding used."]
[null,null,null,"Useful life and replacement schedule indentified."]
[null,null,null,"Contains equipment information and service records."]
[null,null,null,"Specific use software program in place"]
[null,null,null,"Records are up to date."]
[null,null,null,"Asset lifecycle tied to financial, inventory, and CMMS systems."]
[]
[null,null,"Vendor Selection Process"]
[null,null,null,"Process defined and supply chain involved."]
[null,null,null,"Reference checking conducted."]
[null,null,null,"Background check conducted."]
[null,null,null,"No temporary employees allowed.  Must be full time."]
[null,null,null,"Employees are certified for specific equipment."]
[null,null,null,"Liscencing requirements are verified."]
[null,null,null,"Insurance coverage is verified."]
[null,null,null,"Contracts reviewed by legal and supply chain"]
[]
[null,null,"Testing Equipment Calibration Records"]
[null,null,null,"Documented calibration process in place"]
[null,null,null,"Calibration records kept"]
[null,null,null,"Equipment labeled with  last calibration date"]
[null,null,null,"Calibration schedule in place."]
[null,null,null,"Annual budget in place"]
[]
[3,"Safety"]
[null,null,"Workplace Safety Progam"]
[null,null,null,"Plan in place, updated regularly."]
[null,null,null,"Reviewed with all."]
[null,null,null,"Readily available- Electronic Content Management System with version control."]
[null,null,null,"Shared with vendors other onsite personnel."]
[null,null,null,"Reporting and stats available."]
[null,null,null,"Injuries and near misses reported and documented."]
[null,null,null,"Violation policy in place and enforced."]
[null,null,null,"Specific group in charge and safety captains in place at every site."]
[]
[null,null,"Vendor Safety/Orientation Program"]
[null,null,null,"Plan in place, updated regularly."]
[null,null,null,"Data center staff is familiar with vendor program."]
[null,null,null,"Provided to and reviewed with vendors."]
[null,null,null,"Documentation of vendor participation."]
[null,null,null,"Annual renewal requirement."]
[null,null,null,"Consequences in place and enforced."]
[]
[null,null,"Hazard Risk Analysis"]
[null,null,null,"Inventory of all hazardous materials on site"]
[null,null,null,"Material Safety Data Sheet (MSDS) Sheet Program"]
[null,null,null,null,"Onsite and updated regularly"]
[null,null,null,null,"Policies and procedures in place that MSDS in onsite before new material is in place."]
[null,null,null,null,"All materials properly labeled."]
[null,null,null,null,"Evaluation committee in place for every new MSDS.  Evaluate if anything special needed."]
[null,null,null,null,"Old MSDS removed if material is gone."]
[null,null,null,null,"Accessible to all."]
[null,null,null,null,"Hard copies updated in sync with online copies."]
[null,null,null,null,"Review in place from OEM if MSDS updated by OEM."]
[null,null,null,"Hazard Communications Program"]
[null,null,null,null,"Plan to be compliant with new OSHA regulations."]
[null,null,null,null,"Resource: www.osha.gov/dsg/hazcom/index.html"]
[null,null,null,"Material Storage/Waste"]
[null,null,null,null,"Policies defining strorage in place, updated regularly."]
[null,null,null,null,"All materials labeled."]
[null,null,null,null,"MSDS up to date, available."]
{"$rows_left_out":231}